{"text_format":"3","workbook":"xlsx","n_sheets":4,"sheets":["Reisekostenabrechnung","Hinweise","Versionen","Tabelle2"],"not_rendered":{"images":1,"external_links":1,"defined_names":15},"read":"whole","date_system":"1900"}

{"sheet":"Reisekostenabrechnung","index":0,"n_rows":60,"n_cols":25,"rows_kept":60,"merged":[[0,0,1,11],[0,15,4,21],[2,0,3,11],[4,0,4,11],[6,1,6,24],[7,1,7,11],[7,14,7,24],[8,1,8,11],[8,14,8,24],[10,0,10,12],[10,13,10,25],[11,1,11,4],[11,5,11,11],[11,14,11,24],[12,13,12,25],[13,1,13,2],[13,3,13,4],[13,8,13,9],[13,14,13,15],[13,16,13,23],[14,0,14,12],[14,13,14,25],[15,1,15,2],[15,3,15,10],[15,14,15,15],[15,16,15,17],[16,0,16,12],[16,13,16,25],[17,1,17,2],[17,3,17,10],[17,14,17,15],[17,16,17,17],[17,19,17,20],[17,21,17,22],[19,1,19,2],[19,3,19,10],[19,14,19,15],[19,16,19,23],[20,0,20,12],[20,13,20,25],[21,1,21,2],[21,3,21,5],[21,16,21,23],[22,0,22,12],[22,13,22,25],[23,1,23,2],[23,3,23,10],[23,14,25,24],[24,0,24,12],[25,1,25,2],[25,3,25,10],[26,0,26,12],[29,3,29,4],[29,6,29,7],[29,9,29,10],[29,16,29,17],[29,19,29,20],[29,22,29,23],[30,3,30,4],[30,6,30,7],[30,16,30,17],[30,19,30,20],[31,3,31,4],[31,6,31,7],[31,16,31,17],[31,19,31,20],[32,0,32,12],[33,1,33,7],[33,9,33,10],[33,14,33,20],[33,22,33,23],[34,1,34,7],[34,14,34,20],[36,1,36,7],[36,9,36,10],[36,14,36,20],[36,22,36,23],[37,1,37,7],[37,14,37,20],[38,1,38,7],[38,9,38,10],[38,14,38,20],[38,22,38,23],[40,1,40,7],[40,9,40,10],[40,14,40,20],[40,22,40,23],[41,1,41,11],[42,1,42,7],[42,9,42,10],[42,14,42,20],[42,22,42,23],[45,1,45,11],[45,14,45,24],[46,2,46,4],[46,5,46,6],[46,7,46,8],[46,9,46,10],[46,16,46,17],[46,18,46,19],[46,20,46,21],[47,2,47,4],[47,5,47,6],[47,7,47,8],[47,9,47,10],[47,16,47,20],[47,21,47,22],[48,2,48,4],[48,5,48,6],[48,7,48,8],[48,9,48,10],[48,16,48,20],[48,21,48,22],[49,2,49,4],[49,5,49,6],[49,7,49,8],[49,9,49,10],[49,16,49,19],[49,20,49,21],[50,16,50,19],[50,20,50,21],[50,22,50,24],[51,0,51,25],[52,1,52,24],[54,12,60,25],[56,1,56,11],[57,1,57,11],[58,1,58,11],[59,1,59,11]]}
["Reisekostenabrechnung",{"$nulls":14},"HANDBALLVERBAND             WESTFALEN e.V."]
[]
["SR-Coaches und Spielaufsichten"]
[]
[{"$f":"CONCATENATE(\"Stand \",TEXT(Stand_datum,\"TT.MM.JJJ\"), \" (\",Versionen,\")\")","v":"Stand 25.10.2022 (1.31)"}]
[]
[null,"Abrechnung von:"]
[]
[null,"Vorname + Name",{"$nulls":12},"Straße, PLZ Wohnort"]
[]
[]
[{"$nulls":5},"(Meisterschafts-Spiel):",{"$nulls":8},"SR-Coaching bei Turnieren:"]
[]
[null,"Datum: ",{"$nulls":5},"Anwurf: ",null,null,"Uhr",{"$nulls":3},"Turnier:"]
[]
[null,"Ort: ",{"$nulls":12},"Datum:"]
[]
[null,"Sporthalle:",{"$nulls":12},"Beginn*):",{"$nulls":3},"Uhr","Ende*):",{"$nulls":3},"Uhr "]
[]
[null,"Spielklasse:",{"$nulls":12},"Ort: "]
[]
[null,"Spiel-Nr:",{"$nulls":13},"Sporthalle:"]
[]
[null,"Heimverein:",{"$nulls":12},"\n*) bitte Verplichtungszeit (Tätigkeit auf dem Turnier ohne An- und Abreise; Format: hh:mm) angeben"]
[]
[null,"Gastverein:"]
[]
[]
[null,"Fahrtkosten:",{"$nulls":12},"Fahrtkosten:"]
[null,"PKW",{"$nulls":7},{"$f":"IF(AND((D30*0.3)+(G30*0.05)>0,Liga<>\"\",D22<>\"\",B8<>\"\"),(D30*0.3)+(G30*0.05),\"\")","v":""},null,"€",null,null,"PKW",{"$nulls":7},{"$f":"IF(AND((Q30*0.3)+(T30*0.05)>0,B8<>\"\",Q14<>\"\",Q16<>\"\",Q18<>\"\",V18<>\"\"),(Q30*0.3)+(T30*0.05),\"\")","v":""},null,"€"]
[{"$nulls":3},"km - Fahrer",null,null,"km - Beifahrer",{"$nulls":9},"km - Fahrer",null,null,"km - Beifahrer"]
[{"$nulls":3},"( 0,30 € )",null,null,"( 0,05 € )",{"$nulls":9},"( 0,30 € )",null,null,"( 0,05 € )"]
[]
[{"$nulls":11},"€",{"$nulls":12},"€"]
[null,"öffentliche Verkehrsmittel ( Bahn / ÖPNV )",{"$nulls":12},"öffentliche Verkehrsmittel ( Bahn / ÖPNV )"]
[]
[null,"Teilnahme-Entschädigung (s. Tabelle)",{"$nulls":7},{"$f":"IF(AND(DSUM(db,\"Kosten\",such1)>0,Liga<>\"\",D22<>\"\"),DSUM(db,\"Kosten\",such1),\"\")","v":""},null,"€",null,null,"Teilnahme-Entschädigung (s. Tabelle)",{"$nulls":7},{"$f":"IF(AND(DGET(Turniere_Kosten,\"Kosten\",Dauer_1)>0,B8<>\"\",Q14<>\"\",Q16<>\"\",Q18<>\"\",V18<>\"\"),DGET(Turniere_Kosten,\"Kosten\",Dauer_1),\"\")","v":""},null,"€"]
[]
[null,"Zuschlag für Wochentagsspiele\n(außer Feiertage, alle Ligen +10.- €)",{"$nulls":7},{"$f":"IF(IF(OR(TEXT(D14,\"TTT\")=\"Sa\",TEXT(D14,\"TTT\")=\"So\"),0,IF(AND(ISERROR(FIND(\"Freundschaftsspiel\",Liga)),ISERROR(FIND(\"turnier\",Liga)),ISERROR(FIND(\"Turnier\",Liga))),10,0))>0,10,\"\")","v":""},null,"€",null,null,"Zuschlag für Wochentagsspiele\n(außer Feiertage, alle Ligen +10.- €)",{"$nulls":7},{"$f":"IF(IF(OR(TEXT(Q16,\"TTT\")=\"Sa\",TEXT(Q16,\"TTT\")=\"So\"),0,IF(AND(ISERROR(FIND(\"Freundschaftsspiel\",Liga)),ISERROR(FIND(\"turnier\",Liga)),ISERROR(FIND(\"Turnier\",Liga))),10,0))>0,10,\"\")","v":""},null,"€"]
[]
[null,"sonstige Auslagen ( mit Beleg )",{"$nulls":9},"€",null,null,"sonstige Auslagen ( mit Beleg )",{"$nulls":9},"€"]
[]
[null,"Summe",{"$nulls":7},{"$f":"IF(SUM(J41,J37,J34,J30,J39)>0,SUM(J41,J37,J34,J30,J39),\"\")","v":""},null,"€",null,null,"Summe",{"$nulls":7},{"$f":"IF(SUM(W41,W37,W34,W30,W39)>0,SUM(W41,W37,W34,W30,W39),\"\")","v":""},null,"€"]
[]
[]
[null,"Teilnahme-Entschädigungen für Beobachter und Coaches:",{"$nulls":12},"Teilnahme-Entschädigung für das Coaching bei Turnieren:"]
[{"$nulls":5},"Männer",null,"Frauen",null,"Jugend"]
[null,null,"Oberliga",null,null,{"v":40,"d":"40.00 €"},null,{"v":40,"d":"40.00 €"},null,{"v":35,"d":"35.00 €"},{"$nulls":6},"Turnier-Dauer bis 3 Stunden",{"$nulls":4},{"v":30,"d":"30.00 €"}]
[null,null,"Verbandsliga",null,null,{"v":40,"d":"40.00 €"},null,{"v":40,"d":"40.00 €"},null,{"v":35,"d":"35.00 €"},{"$nulls":6},"Turnier-Dauer über 3 Stunden",{"$nulls":4},{"v":55,"d":"55.00 €"}]
[null,null,"Landesliga",null,null,{"v":35,"d":"35.00 €"},null,{"v":35,"d":"35.00 €"},null,{"v":35,"d":"35.00 €"}]
[]
[]
[null,"Ich versichere die Richtigkeit der vorgenannten Angaben und erkläre, dass ich die erforderliche Steuererklärung selbst veranlasse.\nDie notwendigen Belege sind beigefügt bzw. lagen dem Verein zur Einsichtnahme vor.\nDie Erstattung der Beträge erfolgt per Überweisung auf das in Phoenix hinterlegte Bankkonto."]
[]
[]
[null,"Betrag erhalten:"]
[null,{"$f":"IF(Tabelle2!A18<>\", \",Tabelle2!A18,\"\")","v":""}]
[null,"Ort, Datum"]
[]
[null,"Unterschrift"]

{"sheet":"Hinweise","index":1,"n_rows":45,"n_cols":1,"rows_kept":45}
["Hinweise zum Ausfüllen des Formulars"]
[]
["Das Formular ist selbstrechnend. Die Summen werden jedoch nur angezeigt, wenn die nachfolgenden genannten Pflichtfelder ausgefüllt wurden."]
["Bei einem Coaching-Einsatz bei einem Turnier werden alle Angaben im Kopf des Formulars und im Abschnitt \"SR-Coaching bei Turnieren\" ausgefüllt."]
[]
["Bei einem Einsatz bei einem Meisterschaftsspiel sind folgende Angaben erforderlich: Abrechnung von, Art der Tätigkeit (Beobachter, Coach, Spielaufsicht), Datum, Spiel-Nr, Spiel-Klasse."]
[]
["Nach erfolgter Eingabe der Beobachtung im System wird das ausgefüllte Abrechnungsformular (als Excel-, PDF- oder Bilddatei) per Mail an buchhaltung@handballwestfalen.de versendet. Das Formular muss mit einer handschriftlichen Unterschrift (Scan etc.) versehen sein."]
[]
["Coaches schicken ihren Coaching-Bericht zusammen mit Abrechnung ebenfalls an die Mail-Adresse buchhaltung@handballwestfalen.de."]
{"$rows_empty":34}
["(Stand: 30.09.2020)"]

{"sheet":"Versionen","index":2,"n_rows":7,"n_cols":4,"rows_kept":7,"hidden":true}
[null,"Version","Datum","Änderungen"]
[null,"1.0","2019-09-01","Ursprungs-Version"]
[null,{"$f":"\"1.1\"","v":"1.1"},null,"angepasste Spesen-Sätze"]
[null,{"$f":"\"1.2\"","v":"1.2"},null,"Hinweise zur Abrechnung ergänzt"]
[null,{"$f":"\"1.21\"","v":"1.21"},null,"Fehler-Korrektur (Format Spiel-Nr.)"]
[null,"1.3","14.08.2022","Aktualisierung der Sätze"]
[null,{"$f":"\"1.31\"","v":"1.31"},"2022-10-25","Stand-Angabe auf 1. Seite automatisch; Fehlerkorrektur (Wochentags-Zuschlag)"]

{"sheet":"Tabelle2","index":3,"n_rows":19,"n_cols":7,"rows_kept":19,"hidden":true}
[]
[{"$nulls":5},"Liga","Kosten"]
[{"$nulls":5},"Männer Oberliga",40]
[{"$nulls":5},"Männer Verbandsliga",40]
[{"$nulls":5},"Männer Landesliga",35]
[{"$nulls":5},"Frauen Oberliga",40]
["such 1","Liga",{"$nulls":3},"Frauen Verbandsliga",40]
[null,{"$f":"Liga","v":0},{"$nulls":3},"Frauen Landesliga",35]
[{"$nulls":5},"Jugend  (A-C) männlich",35]
[{"$nulls":5},"Jugend (A-C) weiblich",35]
[]
[]
["Verfügungszeit",{"$f":"ABS(Reisekostenabrechnung!$V18-Reisekostenabrechnung!$Q18)","v":"00:00:00"},{"$f":"HOUR(B13) *60+MINUTE(B13)","v":0},null,null,"Turniertyp","Kosten"]
["Dauer_Grenze [Minuten]",180,{"$nulls":3},1,30]
["Dauer_2","Turniertyp",{"$nulls":3},2,55]
[null,{"$f":"IF(C13>B14,2,1)","v":1}]
[]
[{"$f":"CONCATENATE(Reisekostenabrechnung!D16,Reisekostenabrechnung!Q20,\", \",IF(Reisekostenabrechnung!D14<>\"\",TEXT(Reisekostenabrechnung!D14,\"TT.MM.JJJJ\"),\"\"),IF(Reisekostenabrechnung!Q16<>\"\",TEXT(Reisekostenabrechnung!Q16,\"TT.MM.JJJJ\"),\"\"))","v":", "},{"$nulls":4},"Versionsinfo:",{"$f":"INDEX(Versionen!B1:B17,MAX(ROW(Versionen!B1:B17)*(Versionen!B1:B17<>\"\")))","v":"1.31"}]
[{"$nulls":5},"Stand_datum:",{"$f":"INDEX(Versionen!C1:C17,MAX(ROW(Versionen!C1:C17)*(Versionen!C1:C17<>\"\")))","v":44859}]